ISBN,ISSN,LANG.,TITLE,FR.TITLE,ISSUED,FR.ISSUED,PUB.DATE,DESCRIPT.,NOTES,PRICE,URL
  , 1488-0679 (Internet), ENG , Annual report / Ontario Municipal Employees Retirement System. 2021. ,  , Ontario Municipal Employees Retirement Board,  ,  ,  , Available on the Internet. , Internet , https://www.omers.com/About-OMERS/Annual-Reporting 
  , 0835-2437  , ENG , Ontario drug benefit formulary/comparative drug index. v. 43 (2022 Oct 31). ,  , Ministry of Health ,  ,  ,  , Available on the Internet. , Internet , https://www.health.gov.on.ca/en/pro/programs/drugs/edition_43.aspx 
  , 1496-8452 (Online)  , ENG ," Ontario economic accounts. yr. 2022, quarter 2. ",  , Ministry of Finance,  ,  ,  , Available on the Internet. , Internet , https://www.ontario.ca/page/ontario-economic-accounts 
  , 1496-8460 (En ligne) , FRE ,  ," Comptes �conomiques de l'Ontario. yr. 2022, quarter 2. ",  , Minist�re des finances,  ,  , Disponible sur l'Internet. , Internet , https://www.ontario.ca/fr/page/comptes-economiques-de-lontario 
  , 1710-8136 (Internet) , ENG , Air quality in Ontario report. 2019. ,  , Ministry of the Environment,  ,  ,  , Available on the Internet. , Internet , http://www.airqualityontario.com/press/publications.php 
  , 0711-849X  , ENG , Annual report / Ontario Labour Relations Board. 2021/2022. ,  , Ontario Labour Relations Board,  ,  ,  , Available on the Internet. , Internet , http://www.olrb.gov.on.ca/Publications-EN.asp 
  ,  , FRE ,  , Rapport annuel / Commission des relations de travail de l'Ontario. 2021/2022.,  , Commission des relations de travail de l'Ontario,  ,  , Disponible sur l'Internet. , Internet , http://www.olrb.gov.on.ca/Publications-FR.asp 
  , 0705-9787  , ENG , Annual report / McMichael Canadian Art Collection. 2021/2022. ,  , McMichael Canadian Art Collection,  ,  ,  , Available on the Internet. , Internet , https://mcmichael.com/annual-reports/ 
  , 0840-5840  , FRE ,  , Rapport annuel / Collection McMichael d'art canadien. 2021/2022.,  , Collection McMichael d'art canadien ,  ,  , Disponible sur l'Internet. , Internet , https://mcmichael.com/annual-reports/ 
  , 0827-9861  , ENG , Ontario public library statistics. 2021. ,   ," Ministry of Tourism, Culture and Sport",   ,  ,  , Available on the Internet. , Internet , https://data.ontario.ca/dataset/ontario-public-library-statistics 
  , 1710-2480 (Internet) , ENG , Ontario road safety annual report. 2019. ,  , Ministry of Transportation,  ,  ,  , Available on the Internet. , Internet , https://www.ontario.ca/document/ontario-road-safety-annual-reports-orsar 
  , 1712-8471 (En ligne) , FRE ,  , S�curit� routi�re en Ontario : rapport annuel. 2019. ,  , Minist�re des transports. Bureau du programme de s�curit� routi�re,  ,  , Disponible sur l'Internet. , Internet , https://www.ontario.ca/fr/document/rapport-annuel-sur-la-securite-routiere-en-ontario-rasro 
  , 1710-2480 (Internet) , ENG , Ontario road safety annual report. 2018. ,  , Ministry of Transportation,  ,  ,  , Available on the Internet. , Internet , https://www.ontario.ca/document/ontario-road-safety-annual-reports-orsar 
  , 1712-8471 (En ligne) , FRE ,  , S�curit� routi�re en Ontario : rapport annuel. 2018. ,  , Minist�re des transports. Bureau du programme de s�curit� routi�re,  ,  , Disponible sur l'Internet. , Internet , https://www.ontario.ca/fr/document/rapport-annuel-sur-la-securite-routiere-en-ontario-rasro 
  ,  , ENG , Metro Toronto Convention Centre annual report. 2021/22. ,   , Metropolitan Toronto Convention Centre Corporation,   ,  ,  , Available on the Internet. , Internet , https://www.mtccc.com/corporate/plans-reports/ 
  ,  , ENG , Annual report / Northern Ontario Heritage Fund Corporation. 2021/2022. ,   , Northern Ontario Heritage Fund Corporation,   ,  ,  , Available on the Internet. , Internet , https://nohfc.ca/en/pages/about-us/agency-accountability 
  ,  , FRE ,, Rapport annuel / Socie?te? de gestion du fonds du patrimoine du nord de l'Ontario. 2021/22. ,   , Socie?te? de gestion du fonds du patrimoine du nord de l'Ontario,  ,  , Disponible sur l'Internet. , Internet , https://nohfc.ca/en/pages/about-us/agency-accountability 
  ,  , ENG , Annual report / Ausable Bayfield Conservation Authority. 2021. ,  , Ausable Bayfield Conservation Authority,  ,  ,  , Available on the Internet. , Internet , https://www.abca.on.ca/about/annualreports/ 
  ,  , ENG , Annual report / Nottawasaga Valley Conservation Authority. 2021. ,  , Nottawasaga Valley Conservation Authority ,  ,  ,  , Available on the Internet. , Internet , https://www.nvca.on.ca/about/PlansFinancials 
  ,  , ENG , Annual report / Law Foundation of Ontario. 2021. ,  , Law Foundation of Ontario,  ,  ,  , Available on the Internet. , Internet , http://www.lawfoundation.on.ca/who-we-are/annual-reports/ 
  , 1201-5121  , ENG ," Road talk : Ontario's transportation technology transfer digest. v. 27, no. 1. ",  , Ministry of Transportation. Resources Planning Office,  ,  ,  , Available on the Internet. , Internet , https://www.ontario.ca/page/resources-transportation-planners 
  , 1496-2829 (Online)  , ENG , Ontario economic outlook and fiscal review : background papers / Ministry of Finance. 2022. ,  , Ministry of Finance,  ,  ,  , Available on the Internet. , Internet ,https://www.ontario.ca/fallstatement
  , 1496-2837 (En ligne) , FRE ,  , Perspectives �conomiques et revue financi�re de l'Ontario : documents d'information / Minist�re des finances. 2022.,  , Minist�re des finances,  ,  , Disponible sur l'Internet. , Internet ,https://www.ontario.ca/exposeautomne
  , 1492-7551 (Internet) , ENG , Annual report / Ontario Electricity Financial Corporation. 2022. ,  , Ontario Electricity Financial Corporation,  ,  ,  , Available on the Internet. , Internet , https://www.oefc.on.ca/publications.html 
  , 1492-7578 (Internet) , FRE ,  , Rapport annuel / Soci�t� financi�re de l'industrie de l'�lectricit� de l'Ontario. 2022.,  , Soci�t� financi�re de l'industrie de l'�lectricit� de l'Ontario,  ,  , Disponible sur l'Internet. , Internet , https://www.oefc.on.ca/french/publications_fr.html 
  ,  , ENG , Species at risk in Ontario list. 2022. ,  , Ministry of Natural Resources,  ,  ,  , Available on the Internet. , Internet , http://www.ontario.ca/environment-and-energy/species-risk-ontario-list 
  ,  , ENG , Market Surveillance Panel monitoring report on the IESO-administered electricity markets. 2020 Nov.-2021 Apr. ,  , Market Surveillance Panel ,  ,  ,  , Available on the Internet. , Internet , http://www.ontarioenergyboard.ca/OEB/Industry/About+the+OEB/Electricity+Market+Surveillance/Market+Surveillance+Panel+Reports 
  , 1708-4016  , ENG , Annual report / Trillium Gift of Life Network. 2020/21. ,  , Trillium Gift of Life Network ,  ,  ,  , Available on the Internet. , Internet , http://www.giftoflife.on.ca/en/aboutus.htm#annualreport 
  ,  , FRE ,  , Rapport annuel / R�seau Trillium pour le don de vie. 2020/21.,  , R�seau Trillium pour le don de vie,  ,  , Disponible sur l'Internet. , Internet , http://www.giftoflife.on.ca/fr/aboutus.htm#annualreport 
  , 1492-3734  , ENG , Annual Report Highlights. 2021. ,  , Ontario Municipal Employees Retirement Board ,  ,  ,  , Available on the Internet. , Internet , https://www.omers.com/annual-reporting 
  ,  , FRE ,  , Rapport Annuel / OMERS. 2021. ,  , Commission du r�gime de retraite des employ�s municipaux de l'Ontario ,  ,  , Disponible sur l'Internet. , Internet , https://www.omers.com/annual-reporting 
  ,  , ENG , Regulated Price Plan Price Report. Nov. 2022 - Oct. 2023. ,  , Ontario Energy Board ,  ,  ,  , Available on the Internet. , Internet , http://www.ontarioenergyboard.ca/OEB/Industry/Regulatory+Proceedings/Policy+Initiatives+and+Consultations/Regulated+Price+Plan 
  ,  , ENG ," Performance report for Darlington Nuclear. yr. 2022, quarter 2. ",  , Ontario Power Generation,  ,  ,  , Available on the Internet. , Internet , https://www.opg.com/reporting/regulatory-reporting/ 
  ,  , ENG ," Performance report for Pickering Nuclear. yr. 2022, quarter 2. ",  , Ontario Power Generation,  ,  ,  , Available on the Internet. , Internet , https://www.opg.com/reporting/regulatory-reporting/ 
  ,  , FRE ,  ," Road talk : le bulletin ontarien de transfert de technologies des transports. v. 27, no. 1. ",  , Minst�re des transports. Bureau de la planification des ressources,  ,  , Disponible sur l'Internet. , Internet , http://www.mto.gov.on.ca/french/publications/road-talk.shtml 
  , 1718-5629 (Internet) , ENG , Annual report / Chief Drinking Water Inspector. 2020/2021. ,  , Ministry of the Environment ,  ,  ,  , Available on the Internet. , Internet , https://www.ontario.ca/page/drinking-water 
  , 1718-5645 (Internet) , FRE ,  , Rapport annuel / Inspecteur en chef de l'eau potable. 2020/2021. ,  , Minist�re de l'environnement ,  ,  , Disponible sur l'Internet. , Internet , https://www.ontario.ca/fr/page/eau-potable 
  ,  , ENG ," Progress report on contracted electricity supply. yr. 2022, quarter 3. ",  , Ontario Power Authority ,  ,  ,  , Available on the Internet. , Internet , https://www.ieso.ca/power-data/supply-overview/transmission-connected-generation 
  , 1923-5208 (Online)  , ENG , Annual report / Ontario Capital Growth Corporation. 2021/22. ,  , Ontario Capital Growth Corporation ,  ,  ,  , Available on the Internet. , Internet , https://www.ocgc.gov.on.ca/annual-report 
  , 1923-5216 (En ligne) , FRE ,  , Rapport annuel / Soci�t� ontarienne de financement de la croissance. 2021/22.,  , Soci�t� ontarienne de financement de la croissance,  ,  , Disponible sur l'Internet. , Internet , https://www.ocgc.gov.on.ca/fr/rapports-annuels 
  ,  , ENG ," Nuclear Sustainability Services Performance Report : ...Results. yr. 2022, quarter 2. ",  , Ontario Power Generation ,  ,  ,  , Available on the Internet. , Internet , http://www.opg.com/news-and-media/Pages/reports.aspx 
  ,  , ENG , Quarterly infectious diseases surveillance report. 2022 June. ,  , Public Health Ontario ,  ,  ,  , Available on the Internet. , Internet , https://www.publichealthontario.ca/en/data-and-analysis/infectious-disease/infectious-diseases-monthly 
  ,  , FRE ,   , Rapport annuel exercice financier ... / Commission d'arbitrage de la police de l'Ontario. 2022 (French). ,   , Commission d'arbitrage de la police de l'Ontario ,  ,  , Disponible sur l'Internet. , Internet , https://www.policearbitration.gov.on.ca/accountability-for-the-ontario-police-arbitration-commission-opac/?lang=fr 
  , 2561-6412 (Online)  , ENG , Economic and Budget Outlook / Financial Accountability Office of Ontario. 2022 Fall. ,  , Financial Accountability Office ,  ,  ,  , Available on the Internet. , Internet , https://fao-on.org/en/Publications_update 
  , 2561-6420 (En ligne) , FRE ,  , Perspectives �conomiques et budg�taires / Bureau de la responsabilit� financi�re de l'Ontario. 2022 Autumn. ,  , Bureau de la responsabilit� financi�re ,  ,  , Disponible sur l'Internet. , Internet , https://fao-on.org/fr/Publications_update 
  ,  , ENG , Annual Report / Resource Productivity and Recovery Authority. 2021. ,  , Resource Productivity and Recovery Authority ,  ,  ,  , Available on the Internet. , Internet , https://rpra.ca/about-us/documents-and-policies/ 
  ,  , FRE ,, Rapport annuel / Office de la productivite? et de la re?cupe?ration des ressources. 2021. ,  , Office de la productivite? et de la re?cupe?ration des ressources,  ,  , Disponible sur l'Internet. , Internet , https://rpra.ca/about-us/documents-and-policies/ 
  ,  , ENG , Business Plan / Resource Productivity and Recovery Authority. 2023. ,  , Resource Productivity and Recovery Authority ,  ,  ,  , Available on the Internet. , Internet , https://rpra.ca/about-us/documents-and-policies/ 
  ,  , FRE ,, Plan d'Activite?s / Office de la productivite? et de la re?cupe?ration des ressources. 2023. ,  , Office de la productivite? et de la re?cupe?ration des ressources,  ,  , Disponible sur l'Internet. , Internet , https://rpra.ca/about-us/documents-and-policies/ 
  ,  , FRE ,, Plan d'Activite?s / Office de la productivite? et de la re?cupe?ration des ressources. 2022. ,  , Office de la productivite? et de la re?cupe?ration des ressources,  ,  , Disponible sur l'Internet. , Internet , https://rpra.ca/about-us/documents-and-policies/ 
  , 2369-7008 (Online)  , ENG , Ontario Municipal Partnership Fund : ... technical guide. 2023. ,  , Ministry of Finance ,  ,  ,  , Available on the Internet. , Internet , https://www.ontario.ca/document/2023-ontario-municipal-partnership-fund/technical-guide 
  , 2369-7016 (En ligne) , FRE ,  , Fonds de partenariat avec les municipalit�s de l'Ontario (FPMO) : manuel technique. 2023. ,  , Minist�re des finances ,  ,  , Disponible sur l'Internet. , Internet , https://www.ontario.ca/fr/document/fonds-de-partenariat-avec-les-municipalites-de-lontario-de-2023/manuel-technique 
  , 2561-8903 (English)  , ENG , Annual Report / English and Wabigoon Rivers Remediation Panel. 2021/22. ,  ," Ministry of the Environment, Conservation and Parks ",  ,  ,  , Available on the Internet. , Internet , https://www.ontario.ca/page/2021-2022-panel-annual-report-english-and-wabigoon-rivers-remediation-trust 
  , 2561-8911 (French) , FRE ,  , Rapport annuel : Comit� pour l'Assainissement des Rivi�res English et Wabigoon. 2021/22. ,  ," Minist�re de l'environnement, de la protection de la nature et des parcs ",  ,  , Disponible sur l'Internet. , Internet , https://www.ontario.ca/fr/page/rapport-annuel-2021-2022-du-comite-sur-la-fiducie-pour-lassainissement-des-rivieres-english-et-wabigoon 
  ,  , ENG , Annual report / Financial Services Regulatory Authority of Ontario. 2021/22. ,  , Financial Services Regulatory Authority of Ontario ,  ,  ,  , Available on the Internet. , Internet , https://www.fsrao.ca/about-fsra/corporate-reporting 
  ,  , FRE ,  , Rapport annuel / Autorit� ontarienne de r�glementation des services financiers. 2021/22. ,  , Autorit� ontarienne de r�glementation des services financiers ,  ,  , Disponible sur l'Internet. , Internet , https://www.fsrao.ca/fr/propos-de-larsf/rapports-organisationnels 
  ,  , ENG , Ontario labour market report. 2022 Sept. ,  ," Ministry of Labour, Immigration, Training and Skills Development ",  ,  ,  , Available on the Internet. , Internet , https://www.ontario.ca/page/labour-market#reports 
  ,  , FRE ,  , Rapport sur le march� du travail de l'Ontario. 2022 sept. ,  ," Minist�re du Travail, de l'Immigration, de la Formation et du D�veloppement des comp�tences ",  ,  , Disponible sur l'Internet. , Internet , https://www.ontario.ca/fr/page/marche-du-travail 
  ,  , ENG , Sustainability Report / Hydro One. 2021. ,  , Hydro One ,  ,  ,  , Available on the Internet. , Internet , https://www.hydroone.com/sustainability 
 9781486858064  , 1484-9445 (Print)  , ENG ," Report of Activities 2021, Resident Geologist Program, Red Lake Regional Resident Geologist Report: Red Lake and Kenora Districts / by P.M. Malegus, E.G. Amyotte, C.J. Adrianwalla, K.E. Wiebe, P. Bousquet, C.M. Daniels, T.K. Pettigrew and G. Dorland.(Open file report ;  6381)",  , Ontario Geological Survey ,  , Jun. 2022.  ," [124] pages : illustrations, some of which have colour, maps. "," Priced title. To purchase, please contact Publication Sales, Ministry of Northern Development and Mines, phone (705) 670-5691 or toll free 1-888-415-9845, E-mail: pubsales.ndm@ontario.ca. ", See notes , http://www.geologyontario.mndm.gov.on.ca/mndmaccess/mndm_dir.asp?type=pub&id=OFR6381 
 9781486858088  , 1484-9429(Print)  , ENG ," Report of Activities 2021, Resident Geologist Program, Thunder Bay North Regional Resident Geologist Report: Thunder Bay North District / by G.F. Paju, C.E. Kurcinka, T.K. Pettigrew, G. Dorland, C.M. Daniels and P. Bousquet.(Open file report ; 6382). ",  , Ontario Geological Survey ,  , Jun. 2022.  ," [77] pages : illustrations, some of which have colour, maps. "," Priced title. To purchase, please contact Publication Sales, Ministry of Northern Development and Mines, phone (705) 670-5691 or toll free 1-888-415-9845, E-mail: pubsales.ndm@ontario.ca. ", See notes , http://www.geologyontario.mndm.gov.on.ca/mndmaccess/mndm_dir.asp?type=pub&id=OFR6382 
 9781486858101  , 1484-9437 (Print)  , ENG ," Report of Activities 202,1 Resident Geologist Program, Thunder Bay South Regional Resident Geologist Report: Thunder Bay South District / by D.A. Campbell, J.R.B. Jonsson, C.E. Kurcinka, G. Dorland, T.K. Pettigrew, C.M. Daniels and P. Bousquet.(Open file report: 6383) ",  , Ontario Geological Survey ,  , Jun. 2022.  ," [102] pages : illustrations, some of which have colour, maps. "," Priced title. To purchase, please contact Publication Sales, Ministry of Northern Development and Mines, phone (705) 670-5691 or toll free 1-888-415-9845, E-mail: pubsales.ndm@ontario.ca. ", See notes , http://www.geologyontario.mndm.gov.on.ca/mndmaccess/mndm_dir.asp?type=pub&id=OFR6383 
 9781486858125  , 1484-947X (Print)  , ENG ," Report of Activities 2021, Resident Geologist Program, Timmins Regional Resident Geologist Report: Timmins and Sault Ste. Marie Districts / by Z. Azadbakht, D. Bennett, B.K. Maity, P. Bousquet, C.M. Daniels, S.L.K. Hinz, E. Morelli and G. Dorland.(Open file report; 6384) ",  , Ontario Geological Survey ,  , Jun. 2022.  ," [151] pages : illustrations, some of which have colour, maps. "," Priced title. To purchase, please contact Publication Sales, Ministry of Northern Development and Mines, phone (705) 670-5691 or toll free 1-888-415-9845, E-mail: pubsales.ndm@ontario.ca. ", See notes , http://www.geologyontario.mndm.gov.on.ca/mndmaccess/mndm_dir.asp?type=pub&id=OFR6384 
 9781486858149  , 2291-2479 (Print)  , ENG ," Report of Activities 2021, Resident Geologist Program, Southern Ontario Regional Resident Geologist Report: Southeastern Ontario and Southwestern Ontario Districts and Petroleum Operations / by L.A. Mancini, M. Dorado-Troughton, N. Sabiri, P.S. LeBaron, S.L.K. Hinz, G. Dorland and L. Fortner (Open file Report; 6386)  ",  , Ontario Geological Survey ,  , Jun. 2022.  ," [86] pages : illustrations, some of which have colour, maps. "," Priced title. To purchase, please contact Publication Sales, Ministry of Northern Development and Mines, phone (705) 670-5691 or toll free 1-888-415-9845, E-mail: pubsales.ndm@ontario.ca. ", See notes , http://www.geologyontario.mndm.gov.on.ca/mndmaccess/mndm_dir.asp?type=pub&id=OFR6386 
 9781486858149  , 2291-2479 (Print)  , ENG ," Report of Activities 2021, Resident Geologist Program, Kirkland Lake Regional Resident Geologist Report: Kirkland Lake and Sudbury Districts / by P.J. Chadwick, A.S. P�loquin, J. Suma Momoh, M.R. Spencer, P. Bousquet, C.M. Daniels, S.L.K. Hinz, G. Dorland and R.M Todd (Open File Report; 6385) ",  , Ontario Geological Survey ,  , Jun. 2022.  ," [196] pages : illustrations, some of which have colour, maps. "," Priced title. To purchase, please contact Publication Sales, Ministry of Northern Development and Mines, phone (705) 670-5691 or toll free 1-888-415-9845, E-mail: pubsales.ndm@ontario.ca. ", See notes , http://www.geologyontario.mndm.gov.on.ca/mndmaccess/mndm_dir.asp?type=pub&id=OFR6385 
9781486858187  ,0704-2752 (print), ENG ," Index to Published Reports, Maps and Digital Data, Mines and Minerals Division, 2011 to 2015. (Miscellaneous Paper ; 177)(Supplement 2011-2015). ",  , Ontario Geological Survey ,  ,," [70] pages : illustrations, some of which have colour, maps. "," Priced title. To purchase, please contact Publication Sales, Ministry of Northern Development and Mines, phone (705) 670-5691 or toll free 1-888-415-9845, E-mail: pubsales.ndm@ontario.ca. ", See notes , http://www.geologyontario.mndm.gov.on.ca/mndmaccess/mndm_dir.asp?type=pub&id=MP177-2011-2015 
 9781486858224  , 0704-2752 (Print)  , ENG ," Index to Published Reports, Maps and Digital Data, Mines and Minerals Division, 2011 to 2015.(Miscellaneous Paper ; 177) (Supplement 2016-2020). ",  , Ontario Geological Survey ,  ,," [56] pages : illustrations, some of which have colour, maps. "," Priced title. To purchase, please contact Publication Sales, Ministry of Northern Development and Mines, phone (705) 670-5691 or toll free 1-888-415-9845, E-mail: pubsales.ndm@ontario.ca. ", See notes , http://www.geologyontario.mndm.gov.on.ca/mndmaccess/mndm_dir.asp?type=pub&id=MP177-2016-2020 
 9781486858200  , 0704-2752 (Print)  , ENG ," Geographic Index to Published Reports, Maps and Digital Data, Mines and Minerals Division, 2011 - 2015.(Miscellaneous Paper ; 178) (Supplement 2011 - 2015). ",  , Ontario Geological Survey ,  ,," [235] pages : illustrations, some of which have colour, maps. "," Priced title. To purchase, please contact Publication Sales, Ministry of Northern Development and Mines, phone (705) 670-5691 or toll free 1-888-415-9845, E-mail: pubsales.ndm@ontario.ca. ", See notes , http://www.geologyontario.mndm.gov.on.ca/mndmaccess/mndm_dir.asp?type=pub&id=MP178-2011-2015 
  ,  , ENG , Brockville Long Swamp Fen Provincial Park Management Plan. ,  ," Ministry of the Environment, Conservation and Parks ",  ,2022, [24] pages. , Available on the Internet. , Internet , https://www.ontario.ca/page/brockville-long-swamp-fen-provincial-park-management-plan-2022#section-11 
  ,  , ENG , Timber Island Provincial Park Management Plan. ,  ," Ministry of the Environment, Conservation and Parks ",  ,2019," [11] pages : illustrations, maps. ", Available on the Internet. , Internet , https://www.ontario.ca/page/timber-island-provincial-park-management-plan 
  ,  , ENG , OMAFRA's Food Safety Monitoring Program & Results. ,  ," Ministry of Agriculture, Food and Rural Affairs ",  , Aug. 2022.  , [18] pages : illustrations. , Available on the Internet. , Internet , https://www.ontario.ca/page/food-safety-monitoring-program 
  ,  , FRE ,, Programme de contr�lede la salubrit� du MAAARO et r�sultats. ,  ," Minist�re de l'agriculture, de l'alimentation et des affaires rurales ", Aug. 2022.  , [18] pages : illustrations. , Disponible sur l'Internet. , Internet , https://www.ontario.ca/fr/page/programme-de-controle-de-la-salubrite-des-aliments 
  ,  , ENG , OMAFRA's Maple Syrup Monitoring Program and Results. ,  ," Ministry of Agriculture, Food and Rural Affairs ",  , Mar. 2022.  , [8] pages : illustrations. , Available on the Internet. , Internet , https://www.ontario.ca/page/maple-syrup-monitoring-program-and-results 
  ,  , FRE ,, Programme de contr�le de la qualit� du sirop d'�rable et r�sultats. ,  ," Minist�re de l'agriculture, de l'alimentation et des affaries rurales ", Mar. 2022.  , [8] pages : illustrations. , Disponible sur l'Internet. , Internet , https://www.ontario.ca/fr/page/programme-de-controle-de-la-qualite-du-sirop-derable-et-resultats 
  ,  , ENG , Honey Monitoring Program and results : Learn about OMAFRA's Honey Monitoring Program and see a summary of the program's results from the past five years. ,  ," Ministry of Agriculture, Food and Rural Affairs ",  , Aug. 2021.  , [5] pages : illustrations. , Available on the Internet. , Internet , https://www.ontario.ca/page/honey-monitoring-program-and-results 
  ,  , FRE ,, Programme de contr�le de la qualit� du miel et r�sultats : Renseignez-vous sur le Programme de contr�le de la qualit� du miel du MAAARO et examinez les r�sultats du programme obtenus au cours des cinq derni�res ann�es.. ,  ," Minist�re de l'agriculture, de l'alimentation et des affaires rurales ", Aug. 2021.  , [5] pages : illustrations. , Disponible sur l'Internet. , Internet , https://www.ontario.ca/fr/page/programme-de-controle-de-la-qualite-du-miel-et-resultats 