ISBN,ISSN,LANG.,TITLE,FR.TITLE,ISSUED,FR.ISSUED,PUB.DATE,DESCRIPT.,NOTES,PRICE,URL
  , 0835-7781  , ENG , Annual report / St. Lawrence Parks Commission. 2020/2021. ,   , St. Lawrence Parks Commission. ,   ,  ,  , Available only on the Internet. , Internet , https://www.parks.on.ca/about/corporate/business-documents/annual-report/ 
  ,  , FRE ,   , Rapport annuel /  Commission des parcs du Saint-Laurent. 2020/2021. ,   , Commission des parcs du Saint-Laurent ,  ,  , Available only on the Internet. , Internet , https://www.fr.parks.on.ca/a-propos/renseignements-cpsl/document/rapport-annuel/ 
  , 1713-0514  , ENG , Annual report / LCBO. 2020/2021. ,  , Liquor Control Board of Ontario. ,  ,  ,  , Issued also in French under title:  Rapport annuel de la LCBO. Available only on the Internet. , Internet , https://www.lcbo.com/content/lcbo/en/corporate-pages/about/annual-report.html 
  , 1713-0506  , FRE ,  , Rapport annuel de la LCBO. 2020/2021.,  , R�gie des alcools de l'Ontario. ,  ,  , Publi� aussi en anglais sous le titre: Annual report / LCBO. Disponible seulement sur l'Internet. , Internet , https://www.lcbo.com/content/lcbo/fr/corporate-pages/about/annual-report.html 
  , 1496-8452 (Online)  , ENG ," Ontario economic accounts. yr. 2021, quarter 2. ",  , Ministry of Finance. ,  ,  ,  , Issued also in French under title: Comptes �conomiques de l'Ontario. Available only on the Internet. , Internet , https://www.ontario.ca/page/ontario-economic-accounts 
  , 1496-8460 (En ligne) , FRE ,  ," Comptes �conomiques de l'Ontario. yr. 2021, quarter 2. ",  , Minist�re des finances. ,  ,  , Publi� aussi en anglais sous le titre: Ontario economic accounts. Disponible seulement sur l'Internet. , Internet , https://www.ontario.ca/fr/page/comptes-economiques-de-lontario 
  , 0835-2437  , ENG , Ontario drug benefit formulary/comparative drug index. v. 43  (2021 Dec. 17). ,  , Ministry of Health ,  ,  ,  , Available only on the Internet. , Internet , https://www.health.gov.on.ca/en/pro/programs/drugs/edition_43.aspx 
  ,  , ENG , Annual report of the Provincial Judges Pension Board for the period ... 2020/2021. ,  , Provincial Judges Pension Board ,  ,  ,  , Available only on the Internet. , Internet , https://www.ontario.ca/page/provincial-judges-pension-board 
  ,  , ENG ," Operational Guidelines for the Host Family Program : Effective April 1, 2016 / Ministry of Community and Social Services. ",  , Ministry of Community and Social Services ,  , Apr. 2016.  , [18] pages. , Available only on the Internet. , Internet , https://www.mcss.gov.on.ca/en/mcss/publications/developmentalServices/hostfamilydirectives/EN_Host_Family_OG.pdf 
  ,  ,FRE,," Lignes directrices op�rationnelles du Programme de placement en famille h�te : Avril 1, 2016. ",, Minist�re des services sociaux et communautaires , Apr. 2016.  , [18] pages. , Available only on the Internet. , Internet , https://www.mcss.gov.on.ca/fr/mcss/publications/developmentalServices/hostfamilydirectives/FR_Host_Family_OG.pdf 
  ,  , ENG , Passport : Program Guidelines for Adults with a Developmental Disability and their Caregivers : Updated May 2021. ,  ," Ministry of Children, Community and Social Services ",  ,2021, [20] pages. , Available only on the Internet. , Internet , https://www.mcss.gov.on.ca/documents/en/mcss/developmental/Passport_Guidelines_September_2021-EN.pdf 
  ,  ,FRE,, Programme Passport : Lignes directrices du programme Passport s'adressant aux adultes ayant une d�ficience intellectuelle et � leurs fournisseures de soins : Mise � jour : mai 2021. ,, Minist�re des Services � l'enfance et des Services sociaux et communautaires ,2021, [20] pages. , Available only on the Internet. , Internet , https://www.mcss.gov.on.ca/documents/fr/mcss/developmental/Passport_Guidelines_September_2021-FR.pdf 
  ,  , ENG , Winery Agri-Tourism COVID-19 Relief Initiative - Guidelines. ,  , Agricorp ,  , Dec. 2021.  , [5] pages. , Available only on the Internet. , Internet , https://www.agricorp.com/SiteCollectionDocuments/WATR-ProgramGuidelines-en.pdf 
  ,  ,FRE,, Initiative de Secours pour les �stablissements Vinicoles Agrotourisitiques en Raison de la COVID-19 - Lignes Directrices. ,, Agricorp , Dec. 2021.  , [5] pages. , Available only on the Internet. , Internet , https://www.agricorp.com/SiteCollectionDocuments/WATR-ProgramGuidelines-fr.pdf 
  ,  , ENG , Eurasian Wild Boar Transition Assistance Initiative. ,  , Agricorp ,  , Dec. 2021.  , [1] page. , Available only on the Internet. , Internet , https://www.agricorp.com/en-ca/Programs/EurasianWildBoar/Pages/Overview.aspx 
  ,  ,FRE,, Initiative d'aide � la transition pour les �leveurs de sangliers eurasiens. ,, Agricorp , Dec. 2021.  , [1] page. , Available only on the Internet. , Internet , https://www.agricorp.com/fr-ca/Programs/EurasianWildBoar/Pages/Overview.aspx 
  ,  , ENG , COVID-19: Interim Guidance for Schools and Child Care: Omicron Surge. ,  , Ministry of Health ,  ,2022, Version 1.0 [7] pages. , Available only on the Internet. , Internet , https://s3.documentcloud.org/documents/21176829/school_childcare_guidance_omicron-1.pdf 
  ,  , ENG , Ontario Community Environment Fund. ,  ," Ministry of the Environment, Conservation and Parks ",  , May 2021.  , [6] pages. , Available only on the Internet. , Internet , https://www.ontario.ca/page/ontario-community-environment-fund 
  ,  ,FRE,, Fonds ontarien de protection de l'environnement � l'�chelle communautaire. ,," Minist�re de l'environnement, de la protection de la nature et des parcs ", May 2021.  , [6] pages. , Available only on the Internet. , Internet , https://www.ontario.ca/fr/page/fonds-ontarien-de-protection-de-lenvironnement-lechelle-communautaire 
  ,  , ENG , Powering Ontario Hydo One's 2023-2027 Joint Rate Application Investment Plan. ,  , Hydro One ,  , Aug. 2021.  , [18] pages : colour illustrations. , Available only on the Internet. , Internet , https://www.hydroone.com/investorrelations/Documents/eventsandpresentations/Hydro%20One%20Limited%202023-2027%20Joint%20Rate%20Application.pdf 
  ,  , ENG , Non-Energy Benefits Study : Phase II : Quantified Benefits and Qualitative Insights / Prepared for: Independent Electricity System Operator. ,  , Independent Electricity System Operator ,  , Jul. 2021.  , [80] pages : colour illustrations. , Available only on the Internet. , Internet , https://www.ieso.ca/-/media/Files/IESO/Document-Library/conservation-reports/Non-Energy-Benefits-Study-Phase-II.ashx 
  ,  , ENG ," Report of the Honourable J. David Wake, Integrity Commissioner, Re: Vijay Thanigasalam, Member for Scarborough - Rouge Park. ",  , Office of the Integrity Commissioner ,  , Dec. 2021.  , [31] pages. , Available only on the Internet. , Internet ,https://www.oico.on.ca/docs/default-source/commissioner%27s-reports/re-vijay-thanigasalam---december-21-2021.pdf?sfvrsn=3
  , 2564-0976 (Online)  , ENG ," Estimates Briefing Book / Ministry of Labour, Training and Skills Development. 2021/22. ",  ," Ministry of Labour, Training and Skills Development ",  ,  ,  , Available only on the Internet. , Internet , https://www.ontario.ca/page/all-published-plans-and-annual-reports 
  , 2564-0984 (En ligne) , FRE ,  ," Document d'information sur le budget des d�penses / Minist�re du Travail, de la Formation et du D�veloppement des comp�tences. 2021/22. ",  ," Minist�re du Travail, de la Formation et du D�veloppement des comp�tences ",  ,  , Disponible seulement sur l'Internet. , Internet , https://www.ontario.ca/fr/page/tous-plans-publies-et-rapports-annuels 
  ,  , ENG , Sustainability Report / Hydro One. 2020. ,  , Hydro One ,  ,  ,  , Available only on the Internet. , Internet , https://www.hydroone.com/sustainability 
  ,  , ENG , Ontario labour market report. 2021 July. ,  ," Ministry of Labour, Training and Skills Development ",  ,  ,  , Available only on the Internet. , Internet , https://www.ontario.ca/page/labour-market#reports 
  ,  , FRE ,  , Rapport sur le march� du travail de l'Ontario. 2021 juil. ,  ," Minist�re du Travail, de la Formation et du D�veloppement des comp�tences ",  ,  , Disponible seulement sur l'Internet. , Internet , https://www.ontario.ca/fr/page/marche-du-travail 
  ,  , ENG , Ontario labour market report. 2021 Aug. ,  ," Ministry of Labour, Training and Skills Development ",  ,  ,  , Available only on the Internet. , Internet , https://www.ontario.ca/page/labour-market#reports 
  ,  , FRE ,  , Rapport sur le march� du travail de l'Ontario. 2021 ao�t. ,  ," Minist�re du Travail, de la Formation et du D�veloppement des comp�tences ",  ,  , Disponible seulement sur l'Internet. , Internet , https://www.ontario.ca/fr/page/marche-du-travail 
  ,  , ENG , Ontario labour market report. 2021 Sept. ,  ," Ministry of Labour, Training and Skills Development ",  ,  ,  , Available only on the Internet. , Internet , https://www.ontario.ca/page/labour-market#reports 
  ,  , FRE ,  , Rapport sur le march� du travail de l'Ontario. 2021 sept. ,  ," Minist�re du Travail, de la Formation et du D�veloppement des comp�tences ",  ,  , Disponible seulement sur l'Internet. , Internet , https://www.ontario.ca/fr/page/marche-du-travail 
  ,  , ENG , Ontario labour market report. 2021 Oct. ,  ," Ministry of Labour, Training and Skills Development ",  ,  ,  , Available only on the Internet. , Internet , https://www.ontario.ca/page/labour-market#reports 
  ,  , FRE ,  , Rapport sur le march� du travail de l'Ontario. 2021 oct. ,  ," Minist�re du Travail, de la Formation et du D�veloppement des comp�tences ",  ,  , Disponible seulement sur l'Internet. , Internet , https://www.ontario.ca/fr/page/marche-du-travail 
  ,  , ENG , Annual report / Bereavement Authority of Ontario. 2020/21. ,  , Bereavement Authority of Ontario ,  ,  ,  , Available only on the Internet. , Internet , https://thebao.ca/corporate-reporting/ 
  ,  , ENG , Business Plan / Resource Productivity and Recovery Authority. 2022. ,  , Resource Productivity and Recovery Authority ,  ,  ,  , Available only on the Internet. , Internet , https://rpra.ca/about-us/documents-and-policies/ 
  ,  , ENG ," Ontario Employment Report / Ministry of Economic Development, Job Creation and Trade. yr. 2021, quarter 3. ",  ," Ministry of Economic Development, Job Creation and Trade ",  ,  ,  , Available only on the Internet. , Internet , https://www.ontario.ca/document/ontario-employment-reports 
  ,  , FRE ,  ," Rapports sur l'emploi de l'Ontario. yr. 2021, quarter 3. ",  ," Minist�re du D�veloppement �conomique, de la Cr�ation d'emplois et du Commerce ",  ,  , Disponible seulement sur l'Internet. , Internet , https://www.ontario.ca/fr/document/rapports-sur-lemploi-de-lontario 
  , 2560-8614  , ENG , Estimates Briefing Book / Ministry of Infrastructure. 2021/22. ,  , Ministry of Infrastructure ,  ,  ,  , Available only on the Internet. , Internet , https://www.ontario.ca/page/all-published-plans-and-annual-reports 
  ,  , FRE ,  , Document d'information sur le budget des d�penses / Minist�re de l'Infrastructure. 2021/22. ,  , Minist�re de l'Infrastructure ,  ,  , Disponible seulement sur l'Internet. , Internet , https://www.ontario.ca/fr/page/tous-plans-publies-et-rapports-annuels 
  ,  , ENG , Green Bond ... Newsletter / Ontario Financing Authority. 2021. ,  , Ontario Financing Authority ,  ,  ,  , Available only on the Internet. , Internet , https://www.ofina.on.ca/greenbonds/newsletter.htm 
  ,  , FRE ,  , Bulletin sur les Obligations Vertes. 2021. ,  , Office ontarien de financement ,  ,  , Disponible seulement sur l'Internet. , Internet , https://www.ofina.on.ca/french/greenbondsfr/newsletter_fr.htm 
  , 2369-1840 (Online)  , ENG , Estimates Briefing Book / Treasury Board Secretariat. 2021/22. ,  , Treasury Board Secretariat ,  ,  ,  , Available only on the Internet. , Internet , https://www.ontario.ca/page/all-published-plans-and-annual-reports 
  , 2369-1859 (En ligne) , FRE ,  , Document d'information sur le budget des d�penses / Secr�tariat du Conseil du Tr�sor. 2021/22. ,  , Secr�tariat du Conseil du Tr�sor ,  ,  , Disponible seulement sur l'Internet. , Internet , https://www.ontario.ca/fr/page/tous-plans-publies-et-rapports-annuels 
  , 2369-2251 (Online)  , ENG ," Estimates Briefing Book / Ministry of Heritage, Sport, Tourism and Culture Industries. 2021/22. ",  ," Ministry of Heritage, Sport, Tourism and Culture Industries ",  ,  ,  , Available only on the Internet. , Internet , https://www.ontario.ca/page/all-published-plans-and-annual-reports 
  , 2369-226X (En ligne) , FRE ,  ," Publication des plans d'activit�s et rapports annuels / Minist�re des Industries du patrimoine, du sport, du tourisme et de la culture. 2021/22. ",  ," Minist�re des Industries du patrimoine, du sport, du tourisme et de la culture ",  ,  , Disponible seulement sur l'Internet. , Internet , https://www.ontario.ca/fr/page/tous-plans-publies-et-rapports-annuels 
  , 2369-2146 (Online)  , ENG , Estimates Briefing Book / Office of the Premier. 2021/22. ,  , Office of the Premier ,  ,  ,  , Available only on the Internet. , Internet , https://www.ontario.ca/page/all-published-plans-and-annual-reports 
  , 2369-2154 (En ligne) , FRE ,  , Document d'information sur le budget des d�penses / Cabinet de la Premi�re ministre. 2021/22. ,  , Cabinet de la Premi�re ministre ,  ,  , Disponible seulement sur l'Internet. , Internet , https://www.ontario.ca/fr/page/tous-plans-publies-et-rapports-annuels 
  , 2369-1697 (Online)  , ENG , Estimates Briefing Book / Office of the Lieutenant Governor. 2021/22. ,  , Office of the Lieutenant Governor ,  ,  ,  , Available only on the Internet. , Internet , https://www.ontario.ca/page/all-published-plans-and-annual-reports 
  , 2369-1700 (En ligne) , FRE ,  , Document d'information sur le budget des d�penses / Bureau du lieutenant-gouverneur. 2021/22. ,  , Bureau du Lieutenant-gouverneur ,  ,  , Disponible seulement sur l'Internet. , Internet , https://www.ontario.ca/fr/page/tous-plans-publies-et-rapports-annuels 
  , 2369-2049 (Online)  , ENG , Estimates Briefing Book / Ministry of Government and Consumer Services. 2021/22. ,  , Ministry of Government and Consumer Services ,  ,  ,  , Issued also in French under title: Document d'information sur le budget des d�penses et la planification ax�e sur les r�sultats. Available only on the Internet. , Internet , https://www.ontario.ca/page/all-published-plans-and-annual-reports 
  , 2369-2057 (En ligne) , FRE ,  , Document d'information sur le budget des d�penses / Minist�re des Services gouvernementaux et des Services aux consommateurs. 2021/22. ,  , Minist�re des Services gouvernementaux et des Services aux consommateurs ,  ,  , Issued also in French under title: Document d'information sur le budget des d�penses et la planification ax�e sur les r�sultats. Disponible seulement sur l'Internet. , Internet , https://www.ontario.ca/fr/page/tous-plans-publies-et-rapports-annuels 
  , 2369-2022 (Online)  , ENG , Estimates Briefing Book / Ministry of Finance. 2021/22. ,  , Ministry of Finance ,  ,  ,  , Available only on the Internet. , Internet , https://www.ontario.ca/page/all-published-plans-and-annual-reports 
  , 2369-2030 (En ligne) , FRE ,  , Document d'information sur le budget des d�penses / Minist�re des finances. 2021/22. ,  ," Minist�re des finances, issuing body. ",  ,  , Disponible seulement sur l'Internet. , Internet , https://www.ontario.ca/fr/page/tous-plans-publies-et-rapports-annuels 
  , 2562-6035 (Online)  , ENG ," Estimates Briefing Book / Ministry of Economic Development, Job Creation and Trade. 2021/22. ",  ," Ministry of Economic Development, Job Creation and Trade ",  ,  ,  , Available only on the Internet. , Internet , https://www.ontario.ca/page/all-published-plans-and-annual-reports 
  , 2562-6043 (En ligne) , FRE ,  ," Document d'information sur le budget des d�penses / Minist�re du D�veloppement �conomique, de la Cr�ation d'emplois et du Commerce. 2021/22. ",  ," Minist�re du D�veloppement �conomique, de la Cr�ation d'emplois et du Commerce ",  ,  , Disponible seulement sur l'Internet. , Internet , https://www.ontario.ca/fr/page/tous-plans-publies-et-rapports-annuels 
  , 2369-1972 (Online)  , ENG , Estimates briefing book / Cabinet Office. 2021/22. ,  , Executive Council ,  ,  ,  , Available only on the Internet. , Internet , https://www.ontario.ca/page/all-published-plans-and-annual-reports 
  , 2369-1980 (En ligne) , FRE ,  , Document d'information sur le budget des d�penses / Bureau du Conseil des ministres. 2021/22. ,  , Conseil ex�cutif ,  ,  , Disponible seulement sur l'Internet. , Internet , https://www.ontario.ca/fr/page/tous-plans-publies-et-rapports-annuels 
  ,  , ENG , Market Update / Infrastructure Ontario. 2022 Jan. ,  , Infrastructure Ontario ,  ,  ,  , Available only on the Internet. , Internet , https://www.infrastructureontario.ca/News/ 
  ,  , FRE ,  , Mise � jour du march�. 2022 Jan. ,  , Infrastructure Ontario ,  ,  , Disponible seulement sur l'Internet. , Internet , https://www.ontario.ca/exposeautomne 
  ,  , ENG , Annual Report / Pay Equity Hearings Tribunal. 2020/21. ,  , Pay Equity Hearings Tribunal ,  ,  ,  , Available only on the Internet. , Internet , http://www.olrb.gov.on.ca/pec/PEHT/Documents-EN.asp 
  ,  , FRE ,  , Rapport annuel du Tribunal de l'�quit� salariale. 2020/21. ,  , Tribunal de l'�quit� salariale ,  ,  , Disponible seulement sur l'Internet. , Internet , http://www.olrb.gov.on.ca/pec/PEHT/Documents-FR.asp 
  , 2291-3114 (Online)  , ENG , Grants listing  / Ontario Arts Council. 2019/20. ,  , Ontario Arts Council ,  ,  ,  , Text in English and French. Available only on the Internet. , Internet , https://www.arts.on.ca/news-and-publications/publications 
  , 1926-478X  , ENG , Annual report / The Greenbelt Foundation. 2020/2021. ,  , The Greenbelt Foundation. ,  ,  ,  , Available only on the Internet. , Internet , https://www.greenbelt.ca/accountability 
  ,  , FRE ,  ,Commission de protection financie?re des e?leveurs de be?tail rapport annuel. 2018/19,  ,Commission de protection financie?re des e?leveurs de be?tail.,  ,  ,  ,  ,http://www.omafra.gov.on.ca/french/open/lfpb.html
  ,  , ENG , Livestock Financial Protection Board annual report. 2018/19. ,  , Livestock Financial Protection Board ,  ,  ,  , Available only on the Internet. , Internet , http://www.omafra.gov.on.ca/english/open/lfpb.html 
  ,  , ENG , Annual report / Ontario Centre of Innovation. 2020/21. ,  , Ontario Centre of Innovation ,  ,  ,  , Available only on the Internet. , Internet , https://www.oc-innovation.ca/about/resources-publications/annual-report-archive/ 
  ,  , FRE ,  , Rapport annuel / Centre d'innovation de l'Ontario. French. ,  , Centre d'innovation de l'Ontario ,  ,  , Disponible seulement sur l'Internet. , Internet ,https://www.oc-innovation.ca/fr/a-propos-du-cio/ressources-et-publications/archives-des-rapports-annuels/
  , 1920-6690 (Online)  , ENG ," Minister's annual report on drinking water / Ministry of the Environment, Conservation and Parks. 2021. ",  ," Ministry of the Environment, Conservation and Parks ",  ,  ,  , Issued also in French under title: Rapport annuel du ministre sur l'eau potable. Available only on the Internet. , Internet , https://www.ontario.ca/page/drinking-water 
  , 1920-6712 (En ligne) , FRE ,  , Rapport annuel du ministre sur l'eau potable. 2021.,  , Minist�re de l'environnement et de l'action en mati�re de changement climatique. ,  ,  , Publi� aussi en anglais sous le titre: Minister's annual report on drinking water. Disponible seulement sur l'Internet. , Internet , https://www.ontario.ca/fr/page/eau-potable 
  , 1928-3245  , ENG ," Ontario government published plans ... and annual reports ... 2015/16 - 2016/17, 2020/2021-. 2021/ 22. ",  , Ontario ,  ,  ,  , Available only on the Internet. , Internet , https://www.ontario.ca/page/all-published-plans-and-annual-reports 
  ,  , FRE ,  , Plans publi�s ... et rapports annuels ... / Gouvernement de l'Ontario. 2021/ 22. ,  , Assemblée législative.  Statuts et règlements ,  ,  , Disponible seulement sur l'Internet. , Internet , https://www.ontario.ca/fr/page/tous-plans-publies-et-rapports-annuels 
  ,  , ENG , Annual report / Ontario Farm Products Marketing Commission. 2018/2019. ,  , Ontario Farm Products Marketing Commission ,  ,  ,  , Available only on the Internet. , Internet , http://www.omafra.gov.on.ca/english/farmproducts/factsheets/factsheet_index.htm 
  ,  , ENG , Queen's Park insider. 2021 Fall.,   , Ontario Legislature Internship Programme ,   ,  ,  , Available only on the Internet. , Internet , https://www.olipinterns.ca/magazine 
  ,  , ENG ," Ontario demographic quarterly. yr. 2021, quarter 3. ",  , Ministry of Finance ,  ,  ,  , Available only on the Internet. , Internet , https://www.fin.gov.on.ca/en/economy/demographics/quarterly/ 
  ,  , FRE ,  ," Rapport d�mographique trimestriel de l'Ontario. yr. 2021, quarter 3. ",  , Minist�re des finances ,  ,  , Disponible seulement sur l'Internet. , Internet , https://www.fin.gov.on.ca/fr/economy/demographics/quarterly/index.html 
  ,  , ENG , Reliability Outlook : An adequacy assessment of Ontario's electricity system. 2021 Sept. ,  , Independent Electricity System Operator ,  ,  ,  , Available only on the Internet. , Internet , https://ieso.ca/en/Sector-Participants/Planning-and-Forecasting/Reliability-Outlook 
  ,  , ENG , Annual report / Technical Standards & Safety Authority. 2019/2020. ,  , Technical Standards & Safety Authority (Ontario) ,  ,  ,  , Available only on the Internet. , Internet , https://www.tssa.org/en/about-tssa/reports-and-policies.aspx 
  ,  , ENG , Annual report / Technical Standards & Safety Authority. 2020/2021. ,  , Technical Standards & Safety Authority (Ontario) ,  ,  ,  , Available only on the Internet. , Internet , https://www.tssa.org/en/about-tssa/reports-and-policies.aspx 
  , 1480-0853  , FRE ,  , Rapport annuel / Commission des valeurs mobili�res de l'Ontario. 2021.,  , Commission des valeurs mobili�res de l'Ontario ,  ,  , Publi� aussi en anglais sous le titre:  Annual report / Ontario Securities Commission. Disponible seulement sur l'Internet. , Internet ,https://www.osc.ca/fr/notre-sujet/responsabilite/rapport-annuel-de-la-cvmo
  ,  , ENG , Financial statements / Ontario Food Terminal Board. 2018/2019. ,  , Ontario Food Terminal Board. ,  ,  ,  , Available only on the Internet. , Internet , https://www.oftb.com/reports 
  ,  , ENG , Financial statements / Ontario Food Terminal Board. 2019/2020. ,  , Ontario Food Terminal Board. ,  ,  ,  , Available only on the Internet. , Internet , https://www.oftb.com/reports 
  , 1202-3558  , ENG , Public attitudes towards education in Ontario : OISE survey. ed. 20.(Informal series). ,  , Ontario Institute for Studies in Education. ,  ,  ,  , Available only on the Internet. , Internet ,https://www.oise.utoronto.ca/oise/About_OISE/OISE_Survey/index.html
  , 0837-4880  , ENG , Annual report / Ontario Securities Commission. 2021. ,  , Ontario Securities Commission. ,  ,  ,  , Issued also in French under title: Rapport annuel / Commission des valeurs mobili�res de l'Ontario. Available only on the Internet. , Internet , https://www.osc.ca/en/about-us/accountability/osc-annual-report 
  , 0701-6972  , ENG ," Raven. v. 62, no. 4. ",  , Ontario Parks ,  ,  ,  , Available only on the Internet. , Internet , https://www.algonquinpark.on.ca/news/raven.php 
